Reaction Details
TargetBeta-2 adrenergic receptor
LigandBDBM25769
Substrate/Competitorn/a
Meas. Tech.ChEMBL_632380 (CHEMBL1115585)
EC50 68±n/a nM
Citation Baur, FBeattie, DBeer, DBentley, DBradley, MBruce, ICharlton, SJCuenoud, BErnst, RFairhurst, RAFaller, BFarr, DKeller, TFozard, JRFullerton, JGarman, SHatto, JHayden, CHe, HHowes, CJanus, DJiang, ZLewis, CLoeuillet-Ritzler, FMoser, HReilly, JSteward, ASykes, DTedaldi, LTrifilieff, ATweed, MWatson, SWissler, EWyss, D The identification of indacaterol as an ultralong-acting inhaled beta2-adrenoceptor agonist. J Med Chem53:3675-84 (2010) 
 
Beta-2 adrenergic receptor
Name:Beta-2 adrenergic receptor
Type:n/a
Mol. Mass.:46461.69
Organism:Homo sapiens (Human)
Description:P07550
Residue:413
BDBM25769
NameBDBM25769
Synonyms:4-[2-(tert-butylamino)-1-hydroxyethyl]-2-(hydroxymethyl)phenol Proventil Salbutamol,(+/-) | albuterol
TypeSmall organic molecule
Emp. Form.C13H21NO3
Mol. Mass.239.3107
SMILESCC(C)(C)NCC(O)c1ccc(O)c(CO)c1