Reaction Details
TargetC-C chemokine receptor type 5
LigandBDBM50319446
Substrate/Competitorn/a
Meas. Tech.ChEMBL_634191 (CHEMBL1119773)
IC50 21±n/a nM
Citation Rotstein, DMGabriel, SDManser, NFilonova, LPadilla, FSankuratri, SJi, CdeRosier, ADioszegi, MHeilek, GJekle, AWeller, PBerry, P Synthesis, SAR and evaluation of [1,4']-bipiperidinyl-4-yl-imidazolidin-2-one derivatives as novel CCR5 antagonists. Bioorg Med Chem Lett20:3219-22 (2010) 
 
C-C chemokine receptor type 5
Name:C-C chemokine receptor type 5
Type:Enzyme
Mol. Mass.:40540.21
Organism:Homo sapiens (Human)
Description:P51681
Residue:352
BDBM50319446
NameBDBM50319446
Synonyms:(R)-4,6-dimethyl-5-(4'-methyl-4-(2-oxo-5-phenyl-3-(tetrahydro-2H-pyran-4-yl)imidazolidin-1-yl)-1,4'-bipiperidine-1'-carbonyl)picolinonitrile | CHEMBL1085231
TypeSmall organic molecule
Emp. Form.C34H44N6O3
Mol. Mass.584.7516
SMILESCc1cc(nc(C)c1C(=O)N1CCC(C)(CC1)N1CCC(CC1)N1[C@@H](CN(C2CCOCC2)C1=O)c1ccccc1)C#N