Reaction Details
TargetC-C chemokine receptor type 5
LigandBDBM50319451
Substrate/Competitorn/a
Meas. Tech.ChEMBL_634191 (CHEMBL1119773)
IC50 8±n/a nM
Citation Rotstein, DMGabriel, SDManser, NFilonova, LPadilla, FSankuratri, SJi, CdeRosier, ADioszegi, MHeilek, GJekle, AWeller, PBerry, P Synthesis, SAR and evaluation of [1,4']-bipiperidinyl-4-yl-imidazolidin-2-one derivatives as novel CCR5 antagonists. Bioorg Med Chem Lett20:3219-22 (2010) 
 
C-C chemokine receptor type 5
Name:C-C chemokine receptor type 5
Type:Enzyme
Mol. Mass.:40540.21
Organism:Homo sapiens (Human)
Description:P51681
Residue:352
BDBM50319451
NameBDBM50319451
Synonyms:(R)-3-(1'-(4,6-dimethylpyrimidine-5-carbonyl)-4'-methyl-1,4'-bipiperidin-4-yl)-4-phenyl-1-(2-(tetrahydro-2H-pyran-4-yl)ethyl)imidazolidin-2-one | CHEMBL1085226
TypeSmall organic molecule
Emp. Form.C34H48N6O3
Mol. Mass.588.7833
SMILESCc1ncnc(C)c1C(=O)N1CCC(C)(CC1)N1CCC(CC1)N1[C@@H](CN(CCC2CCOCC2)C1=O)c1ccccc1