Reaction Details
TargetAldo-keto reductase family 1 member B1
LigandBDBM16314
Substrate/Competitorn/a
Meas. Tech.ChEMBL_640040 (CHEMBL1174254)
IC50 10±n/a nM
Citation Endo, SMatsunaga, TKuwata, KZhao, HTEl-Kabbani, OKitade, YHara, A Chromene-3-carboxamide derivatives discovered from virtual screening as potent inhibitors of the tumour maker, AKR1B10. Bioorg Med Chem18:2485-90 (2010) 
 
Aldo-keto reductase family 1 member B1
Name:Aldo-keto reductase family 1 member B1
Type:Protein
Mol. Mass.:35855.50
Organism:Homo sapiens (Human)
Description:P15121. 4LAU; 2IKI; 4LB4; 2FZD; 2FZ8; 1US0
Residue:316
BDBM16314
NameBDBM16314
Synonyms:2-{[6-methoxy-5-(trifluoromethyl)naphthalen-1-yl]-N-methylmethanethioamido}acetic acid CHEMBL436 Tolrestat
TypeSmall organic molecule
Emp. Form.C16H14F3NO3S
Mol. Mass.357.347
SMILESCOc1ccc2c(cccc2c1C(F)(F)F)C(=S)N(C)CC(O)=O