Reaction Details
TargetVoltage-dependent T-type calcium channel subunit alpha-1H
LigandBDBM50322936
Substrate/Competitorn/a
Meas. Tech.ChEMBL_643451 (CHEMBL1212315)
IC50 183±n/a nM
Citation Smith, EMSorota, SKim, HMMcKittrick, BANechuta, TLBennett, CKnutson, CBurnett, DAKieselgof, JTan, ZRindgen, DBridal, TZhou, XJia, YPDong, ZMullins, DZhang, XPriestley, TCorrell, CCTulshian, DCzarniecki, MGreenlee, WJ T-type calcium channel blockers: spiro-piperidine azetidines and azetidinones-optimization, design and synthesis. Bioorg Med Chem Lett20:4602-6 (2010) 
 
Voltage-dependent T-type calcium channel subunit alpha-1H
Name:Voltage-dependent T-type calcium channel subunit alpha-1H
Type:Enzyme Catalytic Domain
Mol. Mass.:259187.68
Organism:Homo sapiens (Human)
Description:Calcium channel (Type T,L) 0 0::O95180
Residue:2353
BDBM50322936
NameBDBM50322936
Synonyms:1-(4-chlorophenyl)-N-(3-cyanophenyl)-2-(3-fluorophenyl)-3-oxo-2,7-diazaspiro[3.5]nonane-7-carboxamide | CHEMBL1210506
TypeSmall organic molecule
Emp. Form.C27H22ClFN4O2
Mol. Mass.488.941
SMILESFc1cccc(c1)N1C(c2ccc(Cl)cc2)C2(CCN(CC2)C(=O)Nc2cccc(c2)C#N)C1=O