Reaction Details
TargetVoltage-dependent T-type calcium channel subunit alpha-1H
LigandBDBM50322941
Substrate/Competitorn/a
Meas. Tech.ChEMBL_643451 (CHEMBL1212315)
IC50 116±n/a nM
Citation Smith, EMSorota, SKim, HMMcKittrick, BANechuta, TLBennett, CKnutson, CBurnett, DAKieselgof, JTan, ZRindgen, DBridal, TZhou, XJia, YPDong, ZMullins, DZhang, XPriestley, TCorrell, CCTulshian, DCzarniecki, MGreenlee, WJ T-type calcium channel blockers: spiro-piperidine azetidines and azetidinones-optimization, design and synthesis. Bioorg Med Chem Lett20:4602-6 (2010) 
 
Voltage-dependent T-type calcium channel subunit alpha-1H
Name:Voltage-dependent T-type calcium channel subunit alpha-1H
Type:Enzyme Catalytic Domain
Mol. Mass.:259187.68
Organism:Homo sapiens (Human)
Description:Calcium channel (Type T,L) 0 0::O95180
Residue:2353
BDBM50322941
NameBDBM50322941
Synonyms:2-(3-chlorophenyl)-N-(3,4-difluorophenyl)-1-oxo-3-(pyridin-2-yl)-2,7-diazaspiro[3.5]nonane-7-carboxamide | CHEMBL1210692
TypeSmall organic molecule
Emp. Form.C25H21ClF2N4O2
Mol. Mass.482.91
SMILESFc1ccc(NC(=O)N2CCC3(CC2)C(N(C3=O)c2cccc(Cl)c2)c2ccccn2)cc1F