Reaction Details
TargetVoltage-dependent T-type calcium channel subunit alpha-1H
LigandBDBM50322956
Substrate/Competitorn/a
Meas. Tech.ChEMBL_643451 (CHEMBL1212315)
IC50 256±n/a nM
Citation Smith, EMSorota, SKim, HMMcKittrick, BANechuta, TLBennett, CKnutson, CBurnett, DAKieselgof, JTan, ZRindgen, DBridal, TZhou, XJia, YPDong, ZMullins, DZhang, XPriestley, TCorrell, CCTulshian, DCzarniecki, MGreenlee, WJ T-type calcium channel blockers: spiro-piperidine azetidines and azetidinones-optimization, design and synthesis. Bioorg Med Chem Lett20:4602-6 (2010) 
 
Voltage-dependent T-type calcium channel subunit alpha-1H
Name:Voltage-dependent T-type calcium channel subunit alpha-1H
Type:Enzyme Catalytic Domain
Mol. Mass.:259187.68
Organism:Homo sapiens (Human)
Description:Calcium channel (Type T,L) 0 0::O95180
Residue:2353
BDBM50322956
NameBDBM50322956
Synonyms:(2R,3R)-methyl 2-(1-(4-fluorophenyl)-2-isopropyl-2,7-diazaspiro[3.5]nonane-7-carboxamido)-3-methylpentanoate | CHEMBL1210202
TypeSmall organic molecule
Emp. Form.C24H36FN3O3
Mol. Mass.433.5593
SMILESCC[C@H](C)[C@H](NC(=O)N1CCC2(CN(C(C)C)C2c2ccc(F)cc2)CC1)C(=O)OC