Reaction Details
TargetVoltage-dependent T-type calcium channel subunit alpha-1H
LigandBDBM50322945
Substrate/Competitorn/a
Meas. Tech.ChEMBL_643451 (CHEMBL1212315)
IC50 172±n/a nM
Citation Smith, EMSorota, SKim, HMMcKittrick, BANechuta, TLBennett, CKnutson, CBurnett, DAKieselgof, JTan, ZRindgen, DBridal, TZhou, XJia, YPDong, ZMullins, DZhang, XPriestley, TCorrell, CCTulshian, DCzarniecki, MGreenlee, WJ T-type calcium channel blockers: spiro-piperidine azetidines and azetidinones-optimization, design and synthesis. Bioorg Med Chem Lett20:4602-6 (2010) 
 
Voltage-dependent T-type calcium channel subunit alpha-1H
Name:Voltage-dependent T-type calcium channel subunit alpha-1H
Type:Enzyme Catalytic Domain
Mol. Mass.:259187.68
Organism:Homo sapiens (Human)
Description:Calcium channel (Type T,L) 0 0::O95180
Residue:2353
BDBM50322945
NameBDBM50322945
Synonyms:CHEMBL1210203 | N-(3,5-difluorophenyl)-1-(4-fluorophenyl)-2-isopropyl-2,7-diazaspiro[3.5]nonane-7-carboxamide
TypeSmall organic molecule
Emp. Form.C23H26F3N3O
Mol. Mass.417.4672
SMILESCC(C)N1CC2(CCN(CC2)C(=O)Nc2cc(F)cc(F)c2)C1c1ccc(F)cc1