Reaction Details
TargetVoltage-dependent T-type calcium channel subunit alpha-1H
LigandBDBM50322946
Substrate/Competitorn/a
Meas. Tech.ChEMBL_643451 (CHEMBL1212315)
IC50 325±n/a nM
Citation Smith, EMSorota, SKim, HMMcKittrick, BANechuta, TLBennett, CKnutson, CBurnett, DAKieselgof, JTan, ZRindgen, DBridal, TZhou, XJia, YPDong, ZMullins, DZhang, XPriestley, TCorrell, CCTulshian, DCzarniecki, MGreenlee, WJ T-type calcium channel blockers: spiro-piperidine azetidines and azetidinones-optimization, design and synthesis. Bioorg Med Chem Lett20:4602-6 (2010) 
 
Voltage-dependent T-type calcium channel subunit alpha-1H
Name:Voltage-dependent T-type calcium channel subunit alpha-1H
Type:Enzyme Catalytic Domain
Mol. Mass.:259187.68
Organism:Homo sapiens (Human)
Description:Calcium channel (Type T,L) 0 0::O95180
Residue:2353
BDBM50322946
NameBDBM50322946
Synonyms:CHEMBL1210984 | rac-(2S,3S)-methyl 2-(1-(4-chlorophenyl)-2-cyclopropyl-2,7-diazaspiro[3.5]nonane-7-carboxamido)-3-methylpentanoate
TypeSmall organic molecule
Emp. Form.C24H34ClN3O3
Mol. Mass.447.998
SMILESCC[C@H](C)[C@H](NC(=O)N1CCC2(CN(C3CC3)C2c2ccc(Cl)cc2)CC1)C(=O)OC