Reaction Details
TargetVoltage-dependent T-type calcium channel subunit alpha-1H
LigandBDBM50322962
Substrate/Competitorn/a
Meas. Tech.ChEMBL_643451 (CHEMBL1212315)
IC50 182±n/a nM
Citation Smith, EMSorota, SKim, HMMcKittrick, BANechuta, TLBennett, CKnutson, CBurnett, DAKieselgof, JTan, ZRindgen, DBridal, TZhou, XJia, YPDong, ZMullins, DZhang, XPriestley, TCorrell, CCTulshian, DCzarniecki, MGreenlee, WJ T-type calcium channel blockers: spiro-piperidine azetidines and azetidinones-optimization, design and synthesis. Bioorg Med Chem Lett20:4602-6 (2010) 
 
Voltage-dependent T-type calcium channel subunit alpha-1H
Name:Voltage-dependent T-type calcium channel subunit alpha-1H
Type:Enzyme Catalytic Domain
Mol. Mass.:259187.68
Organism:Homo sapiens (Human)
Description:Calcium channel (Type T,L) 0 0::O95180
Residue:2353
BDBM50322962
NameBDBM50322962
Synonyms:1-(4-chlorophenyl)-2-(3-fluorophenyl)-N-((2S,3S)-3-methyl-1-(methylamino)-1-oxopentan-2-yl)-3-oxo-2,7-diazaspiro[3.5]nonane-7-carboxamide | CHEMBL1210371
TypeSmall organic molecule
Emp. Form.C27H32ClFN4O3
Mol. Mass.515.019
SMILESCC[C@H](C)[C@H](NC(=O)N1CCC2(CC1)C(N(C2=O)c1cccc(F)c1)c1ccc(Cl)cc1)C(=O)NC