Reaction Details
TargetVoltage-dependent T-type calcium channel subunit alpha-1H
LigandBDBM50322949
Substrate/Competitorn/a
Meas. Tech.ChEMBL_643451 (CHEMBL1212315)
IC50 60±n/a nM
Citation Smith, EMSorota, SKim, HMMcKittrick, BANechuta, TLBennett, CKnutson, CBurnett, DAKieselgof, JTan, ZRindgen, DBridal, TZhou, XJia, YPDong, ZMullins, DZhang, XPriestley, TCorrell, CCTulshian, DCzarniecki, MGreenlee, WJ T-type calcium channel blockers: spiro-piperidine azetidines and azetidinones-optimization, design and synthesis. Bioorg Med Chem Lett20:4602-6 (2010) 
 
Voltage-dependent T-type calcium channel subunit alpha-1H
Name:Voltage-dependent T-type calcium channel subunit alpha-1H
Type:Enzyme Catalytic Domain
Mol. Mass.:259187.68
Organism:Homo sapiens (Human)
Description:Calcium channel (Type T,L) 0 0::O95180
Residue:2353
BDBM50322949
NameBDBM50322949
Synonyms:2-(3-chloro-4-fluorophenyl)-7-(6-chloro-5-fluoro-1H-benzo[d]imidazol-2-yl)-3-(pyridin-2-yl)-2,7-diazaspiro[3.5]nonan-1-one | CHEMBL1210901
TypeSmall organic molecule
Emp. Form.C25H19Cl2F2N5O
Mol. Mass.514.354
SMILESFc1ccc(cc1Cl)N1C(c2ccccn2)C2(CCN(CC2)c2nc3cc(Cl)c(F)cc3[nH]2)C1=O