Reaction Details
TargetPotassium voltage-gated channel subfamily H member 2
LigandBDBM50323401
Substrate/Competitorn/a
Meas. Tech.ChEMBL_644071 (CHEMBL1211970)
Ki>1000±n/a nM
Citation Li, JJShanmugasundaram, VReddy, SFleischer, LLWang, ZSmith, YHarter, WGYue, WSSwaroop, MLi, LJi, CXDettling, DOsak, BFitzgerald, LRConradi, R Smoothened antagonists for hair inhibition. Bioorg Med Chem Lett20:4932-5 (2010) 
 
Potassium voltage-gated channel subfamily H member 2
Name:Potassium voltage-gated channel subfamily H member 2
Type:Multi-pass membrane protein
Mol. Mass.:126672.65
Organism:Homo sapiens (Human)
Description:Q12809
Residue:1159
BDBM50323401
NameBDBM50323401
Synonyms:4-((3-(2-fluoro-6-methoxyphenoxy)azetidin-1-yl)methyl)-5-methyl-1-phenyl-1H-pyrazole | CHEMBL1209158
TypeSmall organic molecule
Emp. Form.C21H22FN3O2
Mol. Mass.367.4167
SMILESCOc1cccc(F)c1OC1CN(Cc2cnn(c2C)-c2ccccc2)C1