Reaction Details
TargetMitogen-activated protein kinase 14
LigandBDBM50323413
Substrate/Competitorn/a
Meas. Tech.ChEMBL_644072 (CHEMBL1211971)
IC50 176±n/a nM
Citation Liu, HKuhn, CFeru, FJacques, SLDeshmukh, GDYe, PRennie, GRJohnson, TKazmirski, SLow, SColi, RDing, YHCheng, ACTecle, HEnglish, JMStanton, RWu, JC Enhanced selectivity profile of pyrazole-urea based DFG-out p38alpha inhibitors. Bioorg Med Chem Lett20:4885-91 (2010) 
 
Mitogen-activated protein kinase 14
Name:Mitogen-activated protein kinase 14
Type:Serine/threonine-protein kinase
Mol. Mass.:41286.76
Organism:Homo sapiens (Human)
Description:Q16539
Residue:360
BDBM50323413
NameBDBM50323413
Synonyms:2-amino-N-(3-(3-tert-butyl-5-(3-phenylureido)-1H-pyrazol-1-yl)benzyl)acetamide | CHEMBL1209213
TypeSmall organic molecule
Emp. Form.C23H28N6O2
Mol. Mass.420.5074
SMILESCC(C)(C)c1cc(NC(=O)Nc2ccccc2)n(n1)-c1cccc(CNC(=O)CN)c1