Reaction Details
TargetMitogen-activated protein kinase 14
LigandBDBM50323432
Substrate/Competitorn/a
Meas. Tech.ChEMBL_644072 (CHEMBL1211971)
IC50 78.2±n/a nM
Citation Liu, HKuhn, CFeru, FJacques, SLDeshmukh, GDYe, PRennie, GRJohnson, TKazmirski, SLow, SColi, RDing, YHCheng, ACTecle, HEnglish, JMStanton, RWu, JC Enhanced selectivity profile of pyrazole-urea based DFG-out p38alpha inhibitors. Bioorg Med Chem Lett20:4885-91 (2010) 
 
Mitogen-activated protein kinase 14
Name:Mitogen-activated protein kinase 14
Type:Serine/threonine-protein kinase
Mol. Mass.:41286.76
Organism:Homo sapiens (Human)
Description:Q16539
Residue:360
BDBM50323432
NameBDBM50323432
Synonyms:CHEMBL1209565 | N-(3-(3-tert-butyl-5-(3-phenylureido)-1H-pyrazol-1-yl)benzyl)-2-(3,5-dimethyl-1H-pyrazol-1-yl)acetamide
TypeSmall organic molecule
Emp. Form.C28H33N7O2
Mol. Mass.499.6073
SMILESCc1cc(C)n(CC(=O)NCc2cccc(c2)-n2nc(cc2NC(=O)Nc2ccccc2)C(C)(C)C)n1