Reaction Details
TargetMitogen-activated protein kinase 14
LigandBDBM50323433
Substrate/Competitorn/a
Meas. Tech.ChEMBL_644073 (CHEMBL1211972)
IC50 393±n/a nM
Citation Liu, HKuhn, CFeru, FJacques, SLDeshmukh, GDYe, PRennie, GRJohnson, TKazmirski, SLow, SColi, RDing, YHCheng, ACTecle, HEnglish, JMStanton, RWu, JC Enhanced selectivity profile of pyrazole-urea based DFG-out p38alpha inhibitors. Bioorg Med Chem Lett20:4885-91 (2010) 
 
Mitogen-activated protein kinase 14
Name:Mitogen-activated protein kinase 14
Type:Serine/threonine-protein kinase
Mol. Mass.:41286.76
Organism:Homo sapiens (Human)
Description:Q16539
Residue:360
BDBM50323433
NameBDBM50323433
Synonyms:4-(3-(3-tert-butyl-5-(3-phenylureido)-1H-pyrazol-1-yl)benzylamino)-4-oxobutanoic acid | CHEMBL1209566
TypeSmall organic molecule
Emp. Form.C25H29N5O4
Mol. Mass.463.5289
SMILESCC(C)(C)c1cc(NC(=O)Nc2ccccc2)n(n1)-c1cccc(CNC(=O)CCC(O)=O)c1