Reaction Details
TargetMitogen-activated protein kinase 14
LigandBDBM50323437
Substrate/Competitorn/a
Meas. Tech.ChEMBL_644073 (CHEMBL1211972)
IC50 737±n/a nM
Citation Liu, HKuhn, CFeru, FJacques, SLDeshmukh, GDYe, PRennie, GRJohnson, TKazmirski, SLow, SColi, RDing, YHCheng, ACTecle, HEnglish, JMStanton, RWu, JC Enhanced selectivity profile of pyrazole-urea based DFG-out p38alpha inhibitors. Bioorg Med Chem Lett20:4885-91 (2010) 
 
Mitogen-activated protein kinase 14
Name:Mitogen-activated protein kinase 14
Type:Serine/threonine-protein kinase
Mol. Mass.:41286.76
Organism:Homo sapiens (Human)
Description:Q16539
Residue:360
BDBM50323437
NameBDBM50323437
Synonyms:(1R)-6-(3-(3-tert-butyl-5-(3-phenylureido)-1H-pyrazol-1-yl)benzylcarbamoyl)cyclohex-3-enecarboxylic acid | CHEMBL1209639
TypeSmall organic molecule
Emp. Form.C29H33N5O4
Mol. Mass.515.6034
SMILESCC(C)(C)c1cc(NC(=O)Nc2ccccc2)n(n1)-c1cccc(CNC(=O)C2CC=CC[C@H]2C(O)=O)c1