Reaction Details
TargetMitogen-activated protein kinase 14
LigandBDBM50323434
Substrate/Competitorn/a
Meas. Tech.ChEMBL_644072 (CHEMBL1211971)
IC50 39±n/a nM
Citation Liu, HKuhn, CFeru, FJacques, SLDeshmukh, GDYe, PRennie, GRJohnson, TKazmirski, SLow, SColi, RDing, YHCheng, ACTecle, HEnglish, JMStanton, RWu, JC Enhanced selectivity profile of pyrazole-urea based DFG-out p38alpha inhibitors. Bioorg Med Chem Lett20:4885-91 (2010) 
 
Mitogen-activated protein kinase 14
Name:Mitogen-activated protein kinase 14
Type:Serine/threonine-protein kinase
Mol. Mass.:41286.76
Organism:Homo sapiens (Human)
Description:Q16539
Residue:360
BDBM50323434
NameBDBM50323434
Synonyms:4-(3-(3-tert-butyl-5-(3-phenylureido)-1H-pyrazol-1-yl)benzylamino)-2,2-dimethyl-4-oxobutanoic acid | CHEMBL1209636
TypeSmall organic molecule
Emp. Form.C27H33N5O4
Mol. Mass.491.582
SMILESCC(C)(C)c1cc(NC(=O)Nc2ccccc2)n(n1)-c1cccc(CNC(=O)CC(C)(C)C(O)=O)c1