Reaction Details
TargetMitogen-activated protein kinase 14
LigandBDBM50323429
Substrate/Competitorn/a
Meas. Tech.ChEMBL_644073 (CHEMBL1211972)
IC50 677±n/a nM
Citation Liu, HKuhn, CFeru, FJacques, SLDeshmukh, GDYe, PRennie, GRJohnson, TKazmirski, SLow, SColi, RDing, YHCheng, ACTecle, HEnglish, JMStanton, RWu, JC Enhanced selectivity profile of pyrazole-urea based DFG-out p38alpha inhibitors. Bioorg Med Chem Lett20:4885-91 (2010) 
 
Mitogen-activated protein kinase 14
Name:Mitogen-activated protein kinase 14
Type:Serine/threonine-protein kinase
Mol. Mass.:41286.76
Organism:Homo sapiens (Human)
Description:Q16539
Residue:360
BDBM50323429
NameBDBM50323429
Synonyms:CHEMBL1209484 | N-(3-(3-tert-butyl-5-(3-phenylureido)-1H-pyrazol-1-yl)benzyl)-2-(2-methyl-1H-imidazol-1-yl)acetamide
TypeSmall organic molecule
Emp. Form.C27H31N7O2
Mol. Mass.485.5807
SMILESCc1nccn1CC(=O)NCc1cccc(c1)-n1nc(cc1NC(=O)Nc1ccccc1)C(C)(C)C