Reaction Details
TargetRetinoic acid receptor RXR-alpha
LigandBDBM50324896
Substrate/Competitorn/a
Meas. Tech.ChEMBL_651516 (CHEMBL1227768)
EC50 5.28±n/a nM
Citation Fujii, SOhsawa, FYamada, SShinozaki, RFukai, RMakishima, MEnomoto, STai, AKakuta, H Modification at the acidic domain of RXR agonists has little effect on permissive RXR-heterodimer activation. Bioorg Med Chem Lett20:5139-42 (2010) 
 
Retinoic acid receptor RXR-alpha
Name:Retinoic acid receptor RXR-alpha
Type:PROTEIN
Mol. Mass.:50820.38
Organism:Homo sapiens (Human)
Description:ChEMBL_1456363
Residue:462
BDBM50324896
NameBDBM50324896
Synonyms:6-[N-Ethyl(5,5,8,8-tetramethyl-5,6,7,8-tetrahydro-2-naphthyl)amino]nicotinic acid | CHEMBL1221641
TypeSmall organic molecule
Emp. Form.C22H28N2O2
Mol. Mass.352.4699
SMILESCCN(c1ccc2c(c1)C(C)(C)CCC2(C)C)c1ccc(cn1)C(O)=O