Reaction Details
TargetExtracellular calcium-sensing receptor
LigandBDBM50325727
Substrate/Competitorn/a
Meas. Tech.ChEMBL_652584 (CHEMBL1225787)
EC50 350±n/a nM
Citation Harrington, PESt Jean, DJClarine, JCoulter, TSCroghan, MDavenport, ADavis, JGhiron, CHutchinson, JKelly, MGLott, FLu, JYMartin, DMorony, SPoon, SFPortero-Larragueta, EReagan, JDRegal, KATasker, AWang, MYang, YYao, GZeng, QHenley, CFotsch, C The discovery of an orally efficacious positive allosteric modulator of the calcium sensing receptor containing a dibenzylamine core. Bioorg Med Chem Lett20:5544-7 (2010) 
 
Extracellular calcium-sensing receptor
Name:Extracellular calcium-sensing receptor
Type:Protein
Mol. Mass.:120663.13
Organism:Homo sapiens (Human)
Description:P41180
Residue:1078
BDBM50325727
NameBDBM50325727
Synonyms:(R)-N-((2'-chlorobiphenyl-3-yl)methyl)-1-(3-methoxyphenyl)ethanamine | CHEMBL1224192
TypeSmall organic molecule
Emp. Form.C22H22ClNO
Mol. Mass.351.869
SMILESCOc1cccc(c1)[C@@H](C)NCc1cccc(c1)-c1ccccc1Cl