Reaction Details
TargetExtracellular calcium-sensing receptor
LigandBDBM50325734
Substrate/Competitorn/a
Meas. Tech.ChEMBL_652584 (CHEMBL1225787)
EC50 23±n/a nM
Citation Harrington, PESt Jean, DJClarine, JCoulter, TSCroghan, MDavenport, ADavis, JGhiron, CHutchinson, JKelly, MGLott, FLu, JYMartin, DMorony, SPoon, SFPortero-Larragueta, EReagan, JDRegal, KATasker, AWang, MYang, YYao, GZeng, QHenley, CFotsch, C The discovery of an orally efficacious positive allosteric modulator of the calcium sensing receptor containing a dibenzylamine core. Bioorg Med Chem Lett20:5544-7 (2010) 
 
Extracellular calcium-sensing receptor
Name:Extracellular calcium-sensing receptor
Type:Protein
Mol. Mass.:120663.13
Organism:Homo sapiens (Human)
Description:P41180
Residue:1078
BDBM50325734
NameBDBM50325734
Synonyms:(R)-N-((6-methoxy-4'-(trifluoromethyl)biphenyl-3-yl)methyl)-1-(3-methoxyphenyl)ethanamine | CHEMBL1224340
TypeSmall organic molecule
Emp. Form.C24H24F3NO2
Mol. Mass.415.4481
SMILESCOc1cccc(c1)[C@@H](C)NCc1ccc(OC)c(c1)-c1ccc(cc1)C(F)(F)F