Reaction Details
TargetCannabinoid receptor 1
LigandBDBM50325883
Substrate/Competitorn/a
Meas. Tech.ChEMBL_652678 (CHEMBL1225881)
IC50 73±n/a nM
Citation Letourneau, JJJokiel, POlson, JRiviello, CMHo, KKMcAleer, LYang, JSwanson, RNBaker, JCowley, PEdwards, DWard, NOhlmeyer, MHWebb, ML Identification and hit-to-lead optimization of a novel class of CB1 antagonists. Bioorg Med Chem Lett20:5449-53 (2010) 
 
Cannabinoid receptor 1
Name:Cannabinoid receptor 1
Type:G Protein-Coupled Receptor (GPCR)
Mol. Mass.:52868.96
Organism:Homo sapiens (Human)
Description:P21554
Residue:472
BDBM50325883
NameBDBM50325883
Synonyms:CHEMBL1224457 | N-(1-((6-(4-fluoro-2-methoxyphenyl)pyridin-2-yl)methyl)-1H-benzo[d]imidazol-6-yl)pivalamide
TypeSmall organic molecule
Emp. Form.C25H25FN4O2
Mol. Mass.432.49
SMILESCOc1cc(F)ccc1-c1cccc(Cn2cnc3ccc(NC(=O)C(C)(C)C)cc23)n1