Reaction Details
TargetCannabinoid receptor 1
LigandBDBM50325892
Substrate/Competitorn/a
Meas. Tech.ChEMBL_652678 (CHEMBL1225881)
IC50 7±n/a nM
Citation Letourneau, JJJokiel, POlson, JRiviello, CMHo, KKMcAleer, LYang, JSwanson, RNBaker, JCowley, PEdwards, DWard, NOhlmeyer, MHWebb, ML Identification and hit-to-lead optimization of a novel class of CB1 antagonists. Bioorg Med Chem Lett20:5449-53 (2010) 
 
Cannabinoid receptor 1
Name:Cannabinoid receptor 1
Type:G Protein-Coupled Receptor (GPCR)
Mol. Mass.:52868.96
Organism:Homo sapiens (Human)
Description:P21554
Residue:472
BDBM50325892
NameBDBM50325892
Synonyms:CHEMBL1224613 | N-(3-((6-(benzo[d][1,3]dioxol-4-yl)pyridin-2-yl)methyl)-1-methyl-1H-indol-5-yl)-3-hydroxy-2,2-dimethylpropanamide
TypeSmall organic molecule
Emp. Form.C27H27N3O4
Mol. Mass.457.521
SMILESCn1cc(Cc2cccc(n2)-c2cccc3OCOc23)c2cc(NC(=O)C(C)(C)CO)ccc12