Reaction Details
TargetCalcium/calmodulin-dependent protein kinase type II subunit beta
LigandBDBM4814
Substrate/Competitorn/a
Meas. Tech.ChEMBL_655705 (CHEMBL1244749)
Kd 1400±n/a nM
Citation Zarrinkar, PPGunawardane, RNCramer, MDGardner, MFBrigham, DBelli, BKaraman, MWPratz, KWPallares, GChao, QSprankle, KGPatel, HKLevis, MArmstrong, RCJames, JBhagwat, SS AC220 is a uniquely potent and selective inhibitor of FLT3 for the treatment of acute myeloid leukemia (AML). Blood114:2984-92 (2009) 
 
Calcium/calmodulin-dependent protein kinase type II subunit beta
Name:Calcium/calmodulin-dependent protein kinase type II subunit beta
Type:Enzyme Catalytic Domain
Mol. Mass.:72685.48
Organism:Homo sapiens (Human)
Description:gi_26051204
Residue:666
BDBM4814
NameBDBM4814
Synonyms:CHEMBL535 N-[2-(diethylamino)ethyl]-5-{[(3Z)-5-fluoro-2-oxo-2,3-dihydro-1H-indol-3-ylidene]methyl}-2,4-dimethyl-1H-pyrrole-3-carboxamide SUNITINIB US10464902, Sunitinib US9163010, Sunitinib | US9914707, SU11248
TypeSmall organic molecule
Emp. Form.C22H27FN4O2
Mol. Mass.398.4738
SMILESCCN(CC)CCNC(=O)c1c(C)[nH]c(\C=C2/C(=O)Nc3ccc(F)cc23)c1C