Reaction Details
TargetCalcium/calmodulin-dependent protein kinase type IV
LigandBDBM50326053
Substrate/Competitorn/a
Meas. Tech.ChEMBL_655708 (CHEMBL1244752)
Kd>10000±n/a nM
Citation Zarrinkar, PPGunawardane, RNCramer, MDGardner, MFBrigham, DBelli, BKaraman, MWPratz, KWPallares, GChao, QSprankle, KGPatel, HKLevis, MArmstrong, RCJames, JBhagwat, SS AC220 is a uniquely potent and selective inhibitor of FLT3 for the treatment of acute myeloid leukemia (AML). Blood114:2984-92 (2009) 
 
Calcium/calmodulin-dependent protein kinase type IV
Name:Calcium/calmodulin-dependent protein kinase type IV
Type:PROTEIN
Mol. Mass.:51919.87
Organism:Homo sapiens (Human)
Description:ChEMBL_1459854
Residue:473
BDBM50326053
NameBDBM50326053
Synonyms:CHEMBL608533 | PKC-412
TypeSmall organic molecule
Emp. Form.C35H30N4O4
Mol. Mass.570.6371
SMILESCO[C@@H]1[C@@H](C[C@H]2O[C@]1(C)n1c3ccccc3c3c4CNC(=O)c4c4c5ccccc5n2c4c13)N(C)C(=O)c1ccccc1