Reaction Details
TargetCalcium/calmodulin-dependent protein kinase type II subunit delta
LigandBDBM13535
Substrate/Competitorn/a
Meas. Tech.ChEMBL_655706 (CHEMBL1244750)
Kd>10000±n/a nM
Citation Zarrinkar, PPGunawardane, RNCramer, MDGardner, MFBrigham, DBelli, BKaraman, MWPratz, KWPallares, GChao, QSprankle, KGPatel, HKLevis, MArmstrong, RCJames, JBhagwat, SS AC220 is a uniquely potent and selective inhibitor of FLT3 for the treatment of acute myeloid leukemia (AML). Blood114:2984-92 (2009) 
 
Calcium/calmodulin-dependent protein kinase type II subunit delta
Name:Calcium/calmodulin-dependent protein kinase type II subunit delta
Type:Enzyme Catalytic Domain
Mol. Mass.:56419.78
Organism:Homo sapiens (Human)
Description:Q13557
Residue:499
BDBM13535
NameBDBM13535
Synonyms:4-[6-methoxy-7-(3-piperidin-1-ylpropoxy)quinazolin-4-yl]-N-(4-propan-2-yloxyphenyl)piperazine-1-carboxamide 4-[6-methoxy-7-[3-(1-piperidinyl)propoxy]-4-quinazolinyl]-N-(4-propan-2-yloxyphenyl)-1-piperazinecarboxamide CHEMBL124660 MLN518 cid_3038522
TypeSmall organic molecule
Emp. Form.C31H42N6O4
Mol. Mass.562.703
SMILESCOc1cc2c(ncnc2cc1OCCCN1CCCCC1)N1CCN(CC1)C(=O)Nc1ccc(OC(C)C)cc1