Reaction Details
TargetCalcium/calmodulin-dependent protein kinase type II subunit gamma
LigandBDBM50326054
Substrate/Competitorn/a
Meas. Tech.ChEMBL_655703 (CHEMBL1244747)
Kd>10000±n/a nM
Citation Zarrinkar, PPGunawardane, RNCramer, MDGardner, MFBrigham, DBelli, BKaraman, MWPratz, KWPallares, GChao, QSprankle, KGPatel, HKLevis, MArmstrong, RCJames, JBhagwat, SS AC220 is a uniquely potent and selective inhibitor of FLT3 for the treatment of acute myeloid leukemia (AML). Blood114:2984-92 (2009) 
 
Calcium/calmodulin-dependent protein kinase type II subunit gamma
Name:Calcium/calmodulin-dependent protein kinase type II subunit gamma
Type:Protein
Mol. Mass.:62621.56
Organism:Homo sapiens (Human)
Description:Q13555
Residue:558
BDBM50326054
NameBDBM50326054
Synonyms:CHEMBL1240703
TypeSmall organic molecule
Emp. Form.C35H30N4O5
Mol. Mass.586.6365
SMILESCO[C@@H]1[C@@H](C[C@H]2O[C@]1(C)n1c3ccccc3c3c4[C@H](O)NC(=O)c4c4c5ccccc5n2c4c13)N(C)C(=O)c1ccccc1