Reaction Details
TargetSerine/threonine-protein kinase pim-1
LigandBDBM50326054
Substrate/Competitorn/a
Meas. Tech.ChEMBL_655878 (CHEMBL1244922)
Kd 1800±n/a nM
Citation Zarrinkar, PPGunawardane, RNCramer, MDGardner, MFBrigham, DBelli, BKaraman, MWPratz, KWPallares, GChao, QSprankle, KGPatel, HKLevis, MArmstrong, RCJames, JBhagwat, SS AC220 is a uniquely potent and selective inhibitor of FLT3 for the treatment of acute myeloid leukemia (AML). Blood114:2984-92 (2009) 
 
Serine/threonine-protein kinase pim-1
Name:Serine/threonine-protein kinase pim-1
Type:Protein
Mol. Mass.:35681.82
Organism:Homo sapiens (Human)
Description:P11309
Residue:313
BDBM50326054
NameBDBM50326054
Synonyms:CHEMBL1240703
TypeSmall organic molecule
Emp. Form.C35H30N4O5
Mol. Mass.586.6365
SMILESCO[C@@H]1[C@@H](C[C@H]2O[C@]1(C)n1c3ccccc3c3c4[C@H](O)NC(=O)c4c4c5ccccc5n2c4c13)N(C)C(=O)c1ccccc1