Reaction Details
TargetC-X-C chemokine receptor type 4
LigandBDBM50326057
Substrate/Competitorn/a
Meas. Tech.ChEMBL_656725 (CHEMBL1245769)
IC50 3.36±n/a nM
Citation Jenkinson, SThomson, MMcCoy, DEdelstein, MDanehower, SLawrence, WWheelan, PSpaltenstein, AGudmundsson, K Blockade of X4-tropic HIV-1 cellular entry by GSK812397, a potent noncompetitive CXCR4 receptor antagonist. Antimicrob Agents Chemother54:817-24 (2010) 
 
C-X-C chemokine receptor type 4
Name:C-X-C chemokine receptor type 4
Type:Enzyme
Mol. Mass.:39754.61
Organism:Homo sapiens (Human)
Description:P61073
Residue:352
BDBM50326057
NameBDBM50326057
Synonyms:([5-(4-Methyl-1-piperazinyl)-2-({methyl[(8S)-5,6,7,8-tetrahydro-8-quinolinyl]amino}methyl)imidazo[1,2-a]pyridin-3-yl]methanol) | CHEMBL1242210
TypeSmall organic molecule
Emp. Form.C24H32N6O
Mol. Mass.420.5505
SMILESCN(Cc1nc2cccc(N3CCN(C)CC3)n2c1CO)[C@H]1CCCc2cccnc12