Reaction Details
TargetAurora kinase B
LigandBDBM50326210
Substrate/Competitorn/a
Meas. Tech.ChEMBL_659351 (CHEMBL1247978)
EC50 28±n/a nM
Citation Cee, VJSchenkel, LBHodous, BLDeak, HLNguyen, HNOlivieri, PRRomero, KBak, ABe, XBellon, SBush, TLCheng, ACChung, GCoats, SEden, PMHanestad, KGallant, PLGu, YHuang, XKendall, RLLin, MHMorrison, MJPatel, VFRadinsky, RRose, PERoss, SSun, JRTang, JZhao, HPayton, MGeuns-Meyer, SD Discovery of a potent, selective, and orally bioavailable pyridinyl-pyrimidine phthalazine aurora kinase inhibitor. J Med Chem53:6368-77 (2010) 
 
Aurora kinase B
Name:Aurora kinase B
Type:Protein
Mol. Mass.:39327.72
Organism:Homo sapiens (Human)
Description:Q96GD4
Residue:344
BDBM50326210
NameBDBM50326210
Synonyms:2-(4-Fluorophenylamino)-N-(4-(3-(2-(methylamino)pyrimidin-4-yl)pyridin-2-yloxy)phenyl)benzamide | CHEMBL1243231
TypeSmall organic molecule
Emp. Form.C29H23FN6O2
Mol. Mass.506.5303
SMILESCNc1nccc(n1)-c1cccnc1Oc1ccc(NC(=O)c2ccccc2Nc2ccc(F)cc2)cc1