Reaction Details
TargetAurora kinase B
LigandBDBM50326207
Substrate/Competitorn/a
Meas. Tech.ChEMBL_659351 (CHEMBL1247978)
EC50 15±n/a nM
Citation Cee, VJSchenkel, LBHodous, BLDeak, HLNguyen, HNOlivieri, PRRomero, KBak, ABe, XBellon, SBush, TLCheng, ACChung, GCoats, SEden, PMHanestad, KGallant, PLGu, YHuang, XKendall, RLLin, MHMorrison, MJPatel, VFRadinsky, RRose, PERoss, SSun, JRTang, JZhao, HPayton, MGeuns-Meyer, SD Discovery of a potent, selective, and orally bioavailable pyridinyl-pyrimidine phthalazine aurora kinase inhibitor. J Med Chem53:6368-77 (2010) 
 
Aurora kinase B
Name:Aurora kinase B
Type:Protein
Mol. Mass.:39327.72
Organism:Homo sapiens (Human)
Description:Q96GD4
Residue:344
BDBM50326207
NameBDBM50326207
Synonyms:CHEMBL1243294 | N-(4-(3-(2-(Methylamino)pyrimidin-4-yl)pyridin-2-yloxy)phenyl)-4-phenylphthalazin-1-amine
TypeSmall organic molecule
Emp. Form.C30H23N7O
Mol. Mass.497.5499
SMILESCNc1nccc(n1)-c1cccnc1Oc1ccc(Nc2nnc(-c3ccccc3)c3ccccc23)cc1