Reaction Details
TargetMitogen-activated protein kinase 14
LigandBDBM50327415
Substrate/Competitorn/a
Meas. Tech.ChEMBL_664469 (CHEMBL1259851)
IC50 6±n/a nM
Citation Lin, SWrobleski, STHynes, JPitt, SZhang, RFan, YDoweyko, AMKish, KFSack, JSMalley, MFKiefer, SENewitt, JAMcKinnon, MTrzaskos, JBarrish, JCDodd, JHSchieven, GLLeftheris, K Utilization of a nitrogen-sulfur nonbonding interaction in the design of new 2-aminothiazol-5-yl-pyrimidines as p38a MAP kinase inhibitors. Bioorg Med Chem Lett20:5864-8 (2010) 
 
Mitogen-activated protein kinase 14
Name:Mitogen-activated protein kinase 14
Type:Serine/threonine-protein kinase
Mol. Mass.:41286.76
Organism:Homo sapiens (Human)
Description:Q16539
Residue:360
BDBM50327415
NameBDBM50327415
Synonyms:3-(4-(2-chlorophenyl)-6-(2-(isopropylamino)thiazol-5-yl)pyrimidin-2-ylamino)propane-1,2-diol | CHEMBL1257244
TypeSmall organic molecule
Emp. Form.C19H22ClN5O2S
Mol. Mass.419.928
SMILESCC(C)Nc1ncc(s1)-c1cc(nc(NCC(O)CO)n1)-c1ccccc1Cl