Reaction Details
TargetG-protein coupled bile acid receptor 1
LigandBDBM50327523
Substrate/Competitorn/a
Meas. Tech.ChEMBL_664648 (CHEMBL1260362)
IC50 580±n/a nM
Citation Herbert, MRSiegel, DLStaszewski, LCayanan, CBanerjee, UDhamija, SAnderson, JFan, AWang, LRix, PShiau, AKRao, TSNoble, SAHeyman, RABischoff, EGuha, MKabakibi, APinkerton, AB Synthesis and SAR of 2-aryl-3-aminomethylquinolines as agonists of the bile acid receptor TGR5. Bioorg Med Chem Lett20:5718-21 (2010) 
 
G-protein coupled bile acid receptor 1
Name:G-protein coupled bile acid receptor 1
Type:G Protein-Coupled Receptor (GPCR)
Mol. Mass.:35260.02
Organism:Homo sapiens (Human)
Description:CHO cells transiently transfected with hTGR5.
Residue:330
BDBM50327523
NameBDBM50327523
Synonyms:2-(4-bromophenyl)-N-((7-methoxy-2-(thiophen-2-yl)quinolin-3-yl)methyl)ethanamine | CHEMBL1258530
TypeSmall organic molecule
Emp. Form.C23H21BrN2OS
Mol. Mass.453.395
SMILESCOc1ccc2cc(CNCCc3ccc(Br)cc3)c(nc2c1)-c1cccs1