Reaction Details
TargetG-protein coupled bile acid receptor 1
LigandBDBM50327540
Substrate/Competitorn/a
Meas. Tech.ChEMBL_664648 (CHEMBL1260362)
IC50 82±n/a nM
Citation Herbert, MRSiegel, DLStaszewski, LCayanan, CBanerjee, UDhamija, SAnderson, JFan, AWang, LRix, PShiau, AKRao, TSNoble, SAHeyman, RABischoff, EGuha, MKabakibi, APinkerton, AB Synthesis and SAR of 2-aryl-3-aminomethylquinolines as agonists of the bile acid receptor TGR5. Bioorg Med Chem Lett20:5718-21 (2010) 
 
G-protein coupled bile acid receptor 1
Name:G-protein coupled bile acid receptor 1
Type:G Protein-Coupled Receptor (GPCR)
Mol. Mass.:35260.02
Organism:Homo sapiens (Human)
Description:CHO cells transiently transfected with hTGR5.
Residue:330
BDBM50327540
NameBDBM50327540
Synonyms:3-((4-bromophenethylamino)methyl)-2-(thiophen-3-yl)quinolin-6-ol | CHEMBL1257612
TypeSmall organic molecule
Emp. Form.C22H19BrN2OS
Mol. Mass.439.368
SMILESOc1ccc2nc(-c3ccsc3)c(CNCCc3ccc(Br)cc3)cc2c1