Reaction Details
TargetcAMP-specific 3',5'-cyclic phosphodiesterase 4A
LigandBDBM14361
Substrate/Competitorn/a
Meas. Tech.ChEMBL_665325 (CHEMBL1261002)
IC50 241±n/a nM
Citation Taltavull, JSerrat, JGràcia, JGavaldà, AAndrés, MCórdoba, MMiralpeix, MVilella, DBeleta, JRyder, HPagès, L Synthesis and biological activity of pyrido[3',2':4,5]thieno[3,2-d]pyrimidines as phosphodiesterase type 4 inhibitors. J Med Chem53:6912-22 (2010) 
 
cAMP-specific 3',5'-cyclic phosphodiesterase 4A
Name:cAMP-specific 3',5'-cyclic phosphodiesterase 4A
Type:Enzyme
Mol. Mass.:98113.27
Organism:Homo sapiens (Human)
Description:P27815
Residue:886
BDBM14361
NameBDBM14361
Synonyms:(R,S)-Rolipram 4-[3-(cyclopentyloxy)-4-methoxyphenyl]pyrrolidin-2-one CHEMBL63 | Rolipram
TypeSmall organic molecule
Emp. Form.C16H21NO3
Mol. Mass.275.3428
SMILESCOc1ccc(cc1OC1CCCC1)C1CNC(=O)C1