Reaction Details
TargetMalonyl-CoA decarboxylase, mitochondrial
LigandBDBM50328249
Substrate/Competitorn/a
Meas. Tech.ChEMBL_665404 (CHEMBL1261133)
IC50 3.3±n/a nM
Citation Tang, HYan, YFeng, Zde Jesus, RKYang, LLevorse, DAOwens, KAAkiyama, TEBergeron, RCastriota, GADoebber, TWEllsworth, KPLassman, MELi, CWu, MSZhang, BBChapman, KTMills, SGBerger, JPPasternak, A Design and synthesis of a new class of malonyl-CoA decarboxylase inhibitors with anti-obesity and anti-diabetic activities. Bioorg Med Chem Lett20:6088-92 (2010) 
 
Malonyl-CoA decarboxylase, mitochondrial
Name:Malonyl-CoA decarboxylase, mitochondrial
Type:PROTEIN
Mol. Mass.:55018.37
Organism:Homo sapiens (Human)
Description:ChEMBL_665404
Residue:493
BDBM50328249
NameBDBM50328249
Synonyms:1-(5-(1,1,1,3,3,3-hexafluoro-2-hydroxypropan-2-yl)thiazol-2-yl)-4-phenyl-N-(2,2,2-trifluoroethyl)piperidine-4-carboxamide | CHEMBL1258368
TypeSmall organic molecule
Emp. Form.C20H18F9N3O2S
Mol. Mass.535.426
SMILESOC(c1cnc(s1)N1CCC(CC1)(C(=O)NCC(F)(F)F)c1ccccc1)(C(F)(F)F)C(F)(F)F