Reaction Details
TargetMalonyl-CoA decarboxylase, mitochondrial
LigandBDBM50328227
Substrate/Competitorn/a
Meas. Tech.ChEMBL_665405 (CHEMBL1261134)
EC50 630±n/a nM
Citation Tang, HYan, YFeng, Zde Jesus, RKYang, LLevorse, DAOwens, KAAkiyama, TEBergeron, RCastriota, GADoebber, TWEllsworth, KPLassman, MELi, CWu, MSZhang, BBChapman, KTMills, SGBerger, JPPasternak, A Design and synthesis of a new class of malonyl-CoA decarboxylase inhibitors with anti-obesity and anti-diabetic activities. Bioorg Med Chem Lett20:6088-92 (2010) 
 
Malonyl-CoA decarboxylase, mitochondrial
Name:Malonyl-CoA decarboxylase, mitochondrial
Type:PROTEIN
Mol. Mass.:54752.52
Organism:Mus musculus
Description:ChEMBL_665405
Residue:492
BDBM50328227
NameBDBM50328227
Synonyms:3-(4-(5-(1,1,1,3,3,3-hexafluoro-2-hydroxypropan-2-yl)thiazol-2-yl)piperazin-1-yl)-N-methylbenzamide | CHEMBL1258936
TypeSmall organic molecule
Emp. Form.C18H18F6N4O2S
Mol. Mass.468.417
SMILESCNC(=O)c1cccc(c1)N1CCN(CC1)c1ncc(s1)C(O)(C(F)(F)F)C(F)(F)F