Reaction Details
TargetMalonyl-CoA decarboxylase, mitochondrial
LigandBDBM50328230
Substrate/Competitorn/a
Meas. Tech.ChEMBL_665405 (CHEMBL1261134)
EC50>20000±n/a nM
Citation Tang, HYan, YFeng, Zde Jesus, RKYang, LLevorse, DAOwens, KAAkiyama, TEBergeron, RCastriota, GADoebber, TWEllsworth, KPLassman, MELi, CWu, MSZhang, BBChapman, KTMills, SGBerger, JPPasternak, A Design and synthesis of a new class of malonyl-CoA decarboxylase inhibitors with anti-obesity and anti-diabetic activities. Bioorg Med Chem Lett20:6088-92 (2010) 
 
Malonyl-CoA decarboxylase, mitochondrial
Name:Malonyl-CoA decarboxylase, mitochondrial
Type:PROTEIN
Mol. Mass.:54752.52
Organism:Mus musculus
Description:ChEMBL_665405
Residue:492
BDBM50328230
NameBDBM50328230
Synonyms:1,1,1,3,3,3-hexafluoro-2-(2-(1-(4-fluorophenyl)piperidin-4-yl)thiazol-5-yl)propan-2-ol | CHEMBL1257318
TypeSmall organic molecule
Emp. Form.C17H15F7N2OS
Mol. Mass.428.368
SMILESOC(c1cnc(s1)C1CCN(CC1)c1ccc(F)cc1)(C(F)(F)F)C(F)(F)F