Reaction Details
TargetMalonyl-CoA decarboxylase, mitochondrial
LigandBDBM50328250
Substrate/Competitorn/a
Meas. Tech.ChEMBL_665404 (CHEMBL1261133)
IC50 6.7±n/a nM
Citation Tang, HYan, YFeng, Zde Jesus, RKYang, LLevorse, DAOwens, KAAkiyama, TEBergeron, RCastriota, GADoebber, TWEllsworth, KPLassman, MELi, CWu, MSZhang, BBChapman, KTMills, SGBerger, JPPasternak, A Design and synthesis of a new class of malonyl-CoA decarboxylase inhibitors with anti-obesity and anti-diabetic activities. Bioorg Med Chem Lett20:6088-92 (2010) 
 
Malonyl-CoA decarboxylase, mitochondrial
Name:Malonyl-CoA decarboxylase, mitochondrial
Type:PROTEIN
Mol. Mass.:55018.37
Organism:Homo sapiens (Human)
Description:ChEMBL_665404
Residue:493
BDBM50328250
NameBDBM50328250
Synonyms:4-(2-aminothiazol-4-yl)-7-(5-(1,1,1,3,3,3-hexafluoro-2-hydroxypropan-2-yl)thiazol-2-ylthio)-2H-chromen-2-one | CHEMBL1258481
TypeSmall organic molecule
Emp. Form.C18H9F6N3O3S3
Mol. Mass.525.468
SMILESNc1nc(cs1)-c1cc(=O)oc2cc(Sc3ncc(s3)C(O)(C(F)(F)F)C(F)(F)F)ccc12