Reaction Details
TargetSodium channel protein type 10 subunit alpha
LigandBDBM50329212
Substrate/Competitorn/a
Meas. Tech.ChEMBL_675099 (CHEMBL1272890)
IC50 85±n/a nM
Citation Kort, MEAtkinson, RNThomas, JBDrizin, IJohnson, MSSecrest, MAGregg, RJScanio, MJShi, LHakeem, AHMatulenko, MAChapman, MLKrambis, MJLiu, DShieh, CCZhang, XSimler, GMikusa, JPZhong, CJoshi, SHonore, PRoeloffs, RWerness, SAntonio, BMarsh, KCFaltynek, CRKrafte, DSJarvis, MFMarron, BE Subtype-selective Na(v)1.8 sodium channel blockers: identification of potent, orally active nicotinamide derivatives. Bioorg Med Chem Lett20:6812-5 (2010) 
 
Sodium channel protein type 10 subunit alpha
Name:Sodium channel protein type 10 subunit alpha
Type:Enzyme
Mol. Mass.:219724.17
Organism:Rattus norvegicus (Rat)
Description:Q62968
Residue:1956
BDBM50329212
NameBDBM50329212
Synonyms:CHEMBL1271417 | N-benzyl-5-(4-chlorophenyl)nicotinamide
TypeSmall organic molecule
Emp. Form.C19H15ClN2O
Mol. Mass.322.788
SMILESClc1ccc(cc1)-c1cncc(c1)C(=O)NCc1ccccc1