Reaction Details
TargetTGF-beta receptor type-1
LigandBDBM50329784
Substrate/Competitorn/a
Meas. Tech.ChEMBL_674822 (CHEMBL1272395)
IC50 24±n/a nM
Citation Roth, GJHeckel, ABrandl, TGrauert, MHoerer, SKley, JTSchnapp, GBaum, PMennerich, DSchnapp, APark, JE Design, synthesis, and evaluation of indolinones as inhibitors of the transforming growth factorß receptor I (TGFßRI). J Med Chem53:7287-95 (2010) 
 
TGF-beta receptor type-1
Name:TGF-beta receptor type-1
Type:enzyme
Mol. Mass.:55968.24
Organism:Homo sapiens (Human)
Description:P36897
Residue:503
BDBM50329784
NameBDBM50329784
Synonyms:(Z)-3-[Phenyl-(4-piperidin-1-ylmethyl-phenylamino)-methylene]-2-oxo-2,3-dihydro-1H-indole-6-carboxylic Acid Ethylamide | CHEMBL1271472
TypeSmall organic molecule
Emp. Form.C30H32N4O2
Mol. Mass.480.6007
SMILESCCNC(=O)c1ccc2C(C(=Nc3ccc(CN4CCCCC4)cc3)c3ccccc3)C(=O)Nc2c1