Reaction Details
TargetAldo-keto reductase family 1 member C2
LigandBDBM50330424
Substrate/Competitorn/a
Meas. Tech.ChEMBL_684684 (CHEMBL1285651)
Ki 26±n/a nM
Citation El-Kabbani, OScammells, PJDay, TDhagat, UEndo, SMatsunaga, TSoda, MHara, A Structure-based optimization and biological evaluation of human 20a-hydroxysteroid dehydrogenase (AKR1C1) salicylic acid-based inhibitors. Eur J Med Chem45:5309-17 (2010) 
 
Aldo-keto reductase family 1 member C2
Name:Aldo-keto reductase family 1 member C2
Type:Enzyme
Mol. Mass.:36739.89
Organism:Homo sapiens (Human)
Description:n/a
Residue:323
BDBM50330424
NameBDBM50330424
Synonyms:5-Chloro-4-hydroxy-4'-(trifluoromethoxy)biphenyl-3-carboxylic acid | CHEMBL1277741
TypeSmall organic molecule
Emp. Form.C14H8ClF3O4
Mol. Mass.332.659
SMILESOC(=O)c1cc(cc(Cl)c1O)-c1ccc(OC(F)(F)F)cc1