Reaction Details
TargetAldo-keto reductase family 1 member C1
LigandBDBM50330427
Substrate/Competitorn/a
Meas. Tech.ChEMBL_684688 (CHEMBL1285655)
IC50 100±n/a nM
Citation El-Kabbani, OScammells, PJDay, TDhagat, UEndo, SMatsunaga, TSoda, MHara, A Structure-based optimization and biological evaluation of human 20a-hydroxysteroid dehydrogenase (AKR1C1) salicylic acid-based inhibitors. Eur J Med Chem45:5309-17 (2010) 
 
Aldo-keto reductase family 1 member C1
Name:Aldo-keto reductase family 1 member C1
Type:Enzyme
Mol. Mass.:36793.97
Organism:Homo sapiens (Human)
Description:Recombinant AKR1C1 enzyme was expressed in E. coli.
Residue:323
BDBM50330427
NameBDBM50330427
Synonyms:5-Chloro-4-hydroxybiphenyl-3-carboxylic acid | CHEMBL1275703
TypeSmall organic molecule
Emp. Form.C13H9ClO3
Mol. Mass.248.662
SMILESOC(=O)c1cc(cc(Cl)c1O)-c1ccccc1