Reaction Details
TargetAldo-keto reductase family 1 member C1
LigandBDBM50330425
Substrate/Competitorn/a
Meas. Tech.ChEMBL_684679 (CHEMBL1285646)
Ki 64±n/a nM
Citation El-Kabbani, OScammells, PJDay, TDhagat, UEndo, SMatsunaga, TSoda, MHara, A Structure-based optimization and biological evaluation of human 20a-hydroxysteroid dehydrogenase (AKR1C1) salicylic acid-based inhibitors. Eur J Med Chem45:5309-17 (2010) 
 
Aldo-keto reductase family 1 member C1
Name:Aldo-keto reductase family 1 member C1
Type:Enzyme
Mol. Mass.:36793.97
Organism:Homo sapiens (Human)
Description:Recombinant AKR1C1 enzyme was expressed in E. coli.
Residue:323
BDBM50330425
NameBDBM50330425
Synonyms:3-chloro-2-hydroxy-5-(phenylethynyl)benzoic acid | CHEMBL1275724
TypeSmall organic molecule
Emp. Form.C15H9ClO3
Mol. Mass.272.683
SMILESOC(=O)c1cc(cc(Cl)c1O)C#Cc1ccccc1