Reaction Details
TargetKinesin-like protein KIF11
LigandBDBM50330548
Substrate/Competitorn/a
Meas. Tech.ChEMBL_685005 (CHEMBL1286523)
IC50 140±n/a nM
Citation Fu, RGYou, QDYang, LWu, WTJiang, CXu, XL Design, synthesis and bioevaluation of dihydropyrazolo[3,4-b]pyridine and benzo[4,5]imidazo[1,2-a]pyrimidine compounds as dual KSP and Aurora-A kinase inhibitors for anti-cancer agents. Bioorg Med Chem18:8035-43 (2010) 
 
Kinesin-like protein KIF11
Name:Kinesin-like protein KIF11
Type:PROTEIN
Mol. Mass.:119138.97
Organism:Homo sapiens (Human)
Description:ChEMBL_1457426
Residue:1056
BDBM50330548
NameBDBM50330548
Synonyms:4-Phenyl-6-methyl-N-(4-fluorophenyl)-4,7-dihydro-2Hpyrazole[3,4-b]pyridine-5-carboxamide | CHEMBL1276845
TypeSmall organic molecule
Emp. Form.C20H17FN4O
Mol. Mass.348.3736
SMILESCC1=Nc2[nH]ncc2C(C1C(=O)Nc1ccc(F)cc1)c1ccccc1