Reaction Details
TargetKinesin-like protein KIF11
LigandBDBM50330554
Substrate/Competitorn/a
Meas. Tech.ChEMBL_685005 (CHEMBL1286523)
IC50 400±n/a nM
Citation Fu, RGYou, QDYang, LWu, WTJiang, CXu, XL Design, synthesis and bioevaluation of dihydropyrazolo[3,4-b]pyridine and benzo[4,5]imidazo[1,2-a]pyrimidine compounds as dual KSP and Aurora-A kinase inhibitors for anti-cancer agents. Bioorg Med Chem18:8035-43 (2010) 
 
Kinesin-like protein KIF11
Name:Kinesin-like protein KIF11
Type:PROTEIN
Mol. Mass.:119138.97
Organism:Homo sapiens (Human)
Description:ChEMBL_1457426
Residue:1056
BDBM50330554
NameBDBM50330554
Synonyms:4-Furan-6-methyl-N-(3-chloro-4-fluorophenyl)-4,7-dihydro-2H-pyrazole[3,4-b]pyridine-5-carboxamide | CHEMBL1277198
TypeSmall organic molecule
Emp. Form.C18H14ClFN4O2
Mol. Mass.372.781
SMILESCC1=Nc2[nH]ncc2C(C1C(=O)Nc1ccc(F)c(Cl)c1)c1ccco1