Reaction Details
TargetAurora kinase A
LigandBDBM50330563
Substrate/Competitorn/a
Meas. Tech.ChEMBL_685006 (CHEMBL1286524)
IC50 3000±n/a nM
Citation Fu, RGYou, QDYang, LWu, WTJiang, CXu, XL Design, synthesis and bioevaluation of dihydropyrazolo[3,4-b]pyridine and benzo[4,5]imidazo[1,2-a]pyrimidine compounds as dual KSP and Aurora-A kinase inhibitors for anti-cancer agents. Bioorg Med Chem18:8035-43 (2010) 
 
Aurora kinase A
Name:Aurora kinase A
Type:Serine/threonine-protein kinase
Mol. Mass.:45830.98
Organism:Homo sapiens (Human)
Description:O14965
Residue:403
BDBM50330563
NameBDBM50330563
Synonyms:CHEMBL1277294 | N-(4-Nitrobenzyl)-4-furan-2-methyl-1,4-dihydrobenzo[4,5]imidazo[1,2-a]pyrimidine-3-carboxamide
TypeSmall organic molecule
Emp. Form.C22H17N5O4
Mol. Mass.415.4015
SMILESCC1=Nc2nc3ccccc3n2C(C1C(=O)Nc1ccc(cc1)[N+]([O-])=O)c1ccco1