Reaction Details
TargetAurora kinase A
LigandBDBM50330549
Substrate/Competitorn/a
Meas. Tech.ChEMBL_685006 (CHEMBL1286524)
IC50>50000±n/a nM
Citation Fu, RGYou, QDYang, LWu, WTJiang, CXu, XL Design, synthesis and bioevaluation of dihydropyrazolo[3,4-b]pyridine and benzo[4,5]imidazo[1,2-a]pyrimidine compounds as dual KSP and Aurora-A kinase inhibitors for anti-cancer agents. Bioorg Med Chem18:8035-43 (2010) 
 
Aurora kinase A
Name:Aurora kinase A
Type:Serine/threonine-protein kinase
Mol. Mass.:45830.98
Organism:Homo sapiens (Human)
Description:O14965
Residue:403
BDBM50330549
NameBDBM50330549
Synonyms:4-Phenyl-6-methyl-N-(3-chloro-4-fluorophenyl)-4,7-dihydro-2H-pyrazole[3,4-b]pyridine-5-carboxamide | CHEMBL1276844
TypeSmall organic molecule
Emp. Form.C20H16ClFN4O
Mol. Mass.382.819
SMILESCC1=Nc2[nH]ncc2C(C1C(=O)Nc1ccc(F)c(Cl)c1)c1ccccc1