Reaction Details
TargetAurora kinase A
LigandBDBM50216502
Substrate/Competitorn/a
Meas. Tech.ChEMBL_685006 (CHEMBL1286524)
IC50>50000±n/a nM
Citation Fu, RGYou, QDYang, LWu, WTJiang, CXu, XL Design, synthesis and bioevaluation of dihydropyrazolo[3,4-b]pyridine and benzo[4,5]imidazo[1,2-a]pyrimidine compounds as dual KSP and Aurora-A kinase inhibitors for anti-cancer agents. Bioorg Med Chem18:8035-43 (2010) 
 
Aurora kinase A
Name:Aurora kinase A
Type:Serine/threonine-protein kinase
Mol. Mass.:45830.98
Organism:Homo sapiens (Human)
Description:O14965
Residue:403
BDBM50216502
NameBDBM50216502
Synonyms:4-(3-hydroxy-phenyl)-6-methyl-2-thioxo-1,2,3,4-tetrahydro-pyrimidine-5-carboxylic acid ethyl ester monastrol | rac-monastrol
TypeSmall organic molecule
Emp. Form.C14H16N2O3S
Mol. Mass.292.353
SMILESCCOC(=O)C1C(NC(=S)N=C1C)c1cccc(O)c1