Reaction Details
TargetVascular endothelial growth factor receptor 2
LigandBDBM50331027
Substrate/Competitorn/a
Meas. Tech.ChEMBL_684761 (CHEMBL1285788)
IC50 8±n/a nM
Citation Cho, TPDong, SYJun, FHong, FJLiang, YJLu, XHua, PJLi, LYLei, ZBing, HYing, ZQiong, LFBei, FBGuang, LLShen, GAHong, SGHong, SWTai, MX Novel potent orally active multitargeted receptor tyrosine kinase inhibitors: synthesis, structure-activity relationships, and antitumor activities of 2-indolinone derivatives. J Med Chem53:8140-9 (2010) 
 
Vascular endothelial growth factor receptor 2
Name:Vascular endothelial growth factor receptor 2
Type:Receptor Tyrosine Kinase
Mol. Mass.:151510.97
Organism:Homo sapiens (Human)
Description:P35968
Residue:1356
BDBM50331027
NameBDBM50331027
Synonyms:(Z)-2-(5-Fluoro-2-oxo-1,2-dihydro-indol-3-ylidenemethyl)-3-methyl-5-(2-pyrrolidin-1-yl-ethyl)-1,5,6,7-tetrahydro-pyrrolo[3,2-c]pyridin-4-one | CHEMBL1276890
TypeSmall organic molecule
Emp. Form.C23H25FN4O2
Mol. Mass.408.4686
SMILESCc1c(\C=C2/C(=O)Nc3ccc(F)cc23)[nH]c2CCN(CCN3CCCC3)C(=O)c12